BDBM50010145 CHEMBL105525::{2-Butyl-5-chloro-1-[6-(1H-tetrazol-5-yl)-5,6,7,8-tetrahydro-naphthalen-2-ylmethyl]-1H-imidazol-4-yl}-methanol
SMILES CCCCc1nc(CO)c(Cl)n1Cc1ccc2CC(CCc2c1)c1nnn[nH]1
InChI Key InChIKey=DVNAVSCQIRADLN-UHFFFAOYSA-N
Data  1 IC50
  Tab Delimited (TSV)   2D SDfile   Computed 3D by Vconf -m prep SDfile
Find this compound or compounds like it in BindingDB:
Activity Spreadsheet -- Enzyme Inhibition Constant Data from BindingDB
Found 1 hit for monomerid = 50010145
TargetType-1 angiotensin II receptor B(RAT)
Ciba-Geigy
Curated by ChEMBL
LigandPNGBDBM50010145(CHEMBL105525 | {2-Butyl-5-chloro-1-[6-(1H-tetrazol...)
Affinity DataIC50:  1.40E+3nM. Assay description: Binding affinity against angiotensin II receptor in rat smooth muscle cell preparations
In DepthDetails ArticlePubMed