BDBM50010159 CHEMBL3251683
SMILES N[C@H](Cc1ccccc1)[C@H](O)C(=O)N[C@@H](CCC(N)=O)C(O)=O
InChI Key InChIKey=SCJHONHMTSKYLA-MDZLAQPJSA-N
Data  1 IC50
  Tab Delimited (TSV)   2D SDfile   Computed 3D by Vconf -m prep SDfile
Find this compound or compounds like it in BindingDB:
Activity Spreadsheet -- Enzyme Inhibition Constant Data from BindingDB
Found 1 hit for monomerid = 50010159
TargetAminopeptidase B(Rattus norvegicus)
TBA
Curated by ChEMBL
LigandPNGBDBM50010159(CHEMBL3251683)
Affinity DataIC50:  3.70E+3nM. Assay description: Inhibition of rat liver aminopeptidase B using 0.2 mM L-leucine-beta-naphthylamide by colorimetry
In DepthDetails ArticlePubMed