BDBM50010197 CHEMBL3251691
SMILES CCCCCCC(NC(=O)[C@@H](O)[C@H](N)Cc1ccccc1)C(O)=O
InChI Key InChIKey=QAHVMHDNURLFLM-TUOGLVOQSA-N
Data  1 IC50
  Tab Delimited (TSV)   2D SDfile   Computed 3D by Vconf -m prep SDfile
Find this compound or compounds like it in BindingDB:
Activity Spreadsheet -- Enzyme Inhibition Constant Data from BindingDB
Found 1 hit for monomerid = 50010197
TargetAminopeptidase B(Rattus norvegicus)
TBA
Curated by ChEMBL
LigandPNGBDBM50010197(CHEMBL3251691)
Affinity DataIC50:  9.20E+3nM. Assay description: Inhibition of rat liver aminopeptidase B using 0.2 mM L-leucine-beta-naphthylamide by colorimetry
In DepthDetails ArticlePubMed