BDBM50010211 CHEMBL3251675
SMILES CC(C)C[C@H](NC(=O)[C@H](O)[C@@H](N)Cc1ccccc1)C(O)=O
InChI Key InChIKey=VGGGPCQERPFHOB-MELADBBJSA-N
Data  1 IC50
  Tab Delimited (TSV)   2D SDfile   Computed 3D by Vconf -m prep SDfile
Find this compound or compounds like it in BindingDB:
Activity Spreadsheet -- Enzyme Inhibition Constant Data from BindingDB
Found 1 hit for monomerid = 50010211
TargetAminopeptidase B(Rattus norvegicus)
TBA
Curated by ChEMBL
LigandPNGBDBM50010211(CHEMBL3251675)
Affinity DataIC50: >8.10E+5nM. Assay description: Inhibition of rat liver aminopeptidase B using 0.2 mM L-leucine-beta-naphthylamide by colorimetry
In DepthDetails ArticlePubMed