BDBM50010241 CHEMBL1234672
SMILES O[C@H]1C[C@@H](O[C@@H]1COP(O)(O)=O)n1cc([N+]([O-])=O)c(=O)[nH]c1=O
InChI Key InChIKey=LVLPVLNNXRTCHP-RRKCRQDMSA-N
Data  1 KI
PDB links: 1 PDB ID matches this monomer.
  Tab Delimited (TSV)   2D SDfile   Computed 3D by Vconf -m prep SDfile
Find this compound or compounds like it in BindingDB:
Activity Spreadsheet -- Enzyme Inhibition Constant Data from BindingDB
Found 1 hit for monomerid = 50010241
TargetThymidylate synthase(Lactobacillus casei)
TBA
Curated by ChEMBL
LigandPNGBDBM50010241(CHEMBL1234672)
Affinity DataKi:  29nM. Assay description: Competitive inhibition of thymidylate synthase purified from methotrexate-resistant Lactobacillus casei using 2'-deoxy[5-3H]uridine 5'-phosphate by r...
In DepthDetails ArticlePubMed