BDBM50010266 CHEMBL324659::{6-[3-(4-Hydroxy-phenyl)-propionylamino]-hexyl}-carbamic acid 6,10,10b-trihydroxy-3,4a,7,7,10a-pentamethyl-1-oxo-3-vinyl-dodecahydro-benzo[f]chromen-5-yl ester
SMILES CC1(C)CC[C@H](O)[C@@]2(C)[C@H]1[C@H](O)[C@H](OC(=O)NCCCCCCNC(=O)CCc1ccc(O)cc1)[C@@]1(C)O[C@](C)(CC(=O)[C@]21O)C=C
InChI Key InChIKey=LRRICCZPJLNFNJ-LMEGHBGNSA-N
Data  2 Kd
  Tab Delimited (TSV)   2D SDfile   Computed 3D by Vconf -m prep SDfile
Find this compound or compounds like it in BindingDB:
Activity Spreadsheet -- Enzyme Inhibition Constant Data from BindingDB
Found 2 hits for monomerid = 50010266
TargetAdenylate cyclase type 1(Bos taurus)
Food And Drug Administration
Curated by ChEMBL
LigandPNGBDBM50010266(CHEMBL324659 | {6-[3-(4-Hydroxy-phenyl)-propionyla...)
Affinity DataKd:  82nM. Assay description: Displacement of [125I]-6-IHPP-Fsk from adenylate cyclase of bovine brain membrane
In DepthDetails ArticlePubMed
TargetSolute carrier family 2, facilitated glucose transporter member 1(Homo sapiens (Human))
Food And Drug Administration
Curated by ChEMBL
LigandPNGBDBM50010266(CHEMBL324659 | {6-[3-(4-Hydroxy-phenyl)-propionyla...)
Affinity DataKd:  400nM. Assay description: Inhibition of [125I]-7-IHPP-Fsk binding to glucose transporter of human erythrocyte membrane
In DepthDetails ArticlePubMed