BDBM50010286 2-Chlorospiro[9H-fluorene-9,5'-isothiazolidin]-3'-one 1',1'-Dioxide::CHEMBL326920
SMILES Clc1ccc2-c3ccccc3C3(CC(=O)NS3(=O)=O)c2c1
InChI Key InChIKey=KOBIEHVHJRAJOC-UHFFFAOYSA-N
Data  2 IC50
  Tab Delimited (TSV)   2D SDfile   Computed 3D by Vconf -m prep SDfile
Find this compound or compounds like it in BindingDB:
Activity Spreadsheet -- Enzyme Inhibition Constant Data from BindingDB
Found 2 hits for monomerid = 50010286
TargetAldo-keto reductase family 1 member B1(Rattus norvegicus)
Alcon Laboratories
Curated by ChEMBL
LigandPNGBDBM50010286(2-Chlorospiro[9H-fluorene-9,5'-isothiazolidin]-3'-...)
Affinity DataIC50:  105nM. Assay description: In vitro inhibitory activity against L-Hexonate Dehydrogenase (L-HDH) from rat kidney (RK)
In DepthDetails ArticlePubMed
TargetAldo-keto reductase family 1 member B1(Rattus norvegicus)
Alcon Laboratories
Curated by ChEMBL
LigandPNGBDBM50010286(2-Chlorospiro[9H-fluorene-9,5'-isothiazolidin]-3'-...)
Affinity DataIC50:  233nM. Assay description: In vitro inhibition of Aldose reductase (AR) from rat lens (RL)
In DepthDetails ArticlePubMed