BDBM50010287 CHEMBL3138844
SMILES COc1ccc(cc1)C(N)=N
InChI Key InChIKey=CSISQILZUHMAJB-UHFFFAOYSA-N
Data  2 KI
PDB links: 1 PDB ID matches this monomer.
  Tab Delimited (TSV)   2D SDfile   Computed 3D by Vconf -m prep SDfile
Find this compound or compounds like it in BindingDB:
Activity Spreadsheet -- Enzyme Inhibition Constant Data from BindingDB
Found 2 hits for monomerid = 50010287
TargetProthrombin(Homo sapiens (Human))
TBA
Curated by ChEMBL
LigandPNGBDBM50010287(CHEMBL3138844)
Affinity DataKi:  3.16E+4nM. Assay description: Competitive inhibition of esterase activity of human activated C1s subunit of first complement component assessed as decrease in p-nitrophenol produc...
In DepthDetails ArticlePubMed
TargetComplement C1s subcomponent(Homo sapiens (Human))
TBA
Curated by ChEMBL
LigandPNGBDBM50010287(CHEMBL3138844)
Affinity DataKi:  1.00E+5nM. Assay description: Competitive inhibition of esterase activity of human activated C1s subunit of first complement component assessed as decrease in p-nitrophenol produc...
In DepthDetails ArticlePubMed