BDBM50010317 CHEMBL3251365
SMILES CC(=O)NCCCCCCNc1ncnc2n(cnc12)[C@@H]1O[C@H](COP(O)(=O)OP(O)(=O)OP(O)(O)=O)[C@@H](O)[C@H]1O
InChI Key InChIKey=RWCYUHWDOIKAMW-SCFUHWHPSA-N
Data  1 KI
  Tab Delimited (TSV)   2D SDfile   Computed 3D by Vconf -m prep SDfile
Find this compound or compounds like it in BindingDB:
Activity Spreadsheet -- Enzyme Inhibition Constant Data from BindingDB
Found 1 hit for monomerid = 50010317
TargetGTP:AMP phosphotransferase AK3, mitochondrial(Rattus norvegicus)
TBA
Curated by ChEMBL
LigandPNGBDBM50010317(CHEMBL3251365)
Affinity DataKi:  4.75E+6nM. Assay description: Competitive inhibition of Sprague-Dawley rat liver adenylate kinase 3 by Lineweaver-Burk plot analysis
In DepthDetails ArticlePubMed