BDBM50010567 6-[2-Hydroxy-3-(naphthalen-1-yloxy)-propylamino]-heptanoic acid p-tolylamide(S,R)::CHEMBL70679
SMILES C[C@H](CCCCC(=O)Nc1ccc(C)cc1)NC[C@H](O)COc1cccc2ccccc12
InChI Key InChIKey=GYGLUIKOLCBIDX-QPPBQGQZSA-N
Data  1 KI
  Tab Delimited (TSV)   2D SDfile   Computed 3D by Vconf -m prep SDfile
Find this compound or compounds like it in BindingDB:
Activity Spreadsheet -- Enzyme Inhibition Constant Data from BindingDB
Found 1 hit for monomerid = 50010567
TargetBeta-2 adrenergic receptor(Mus musculus)
University Of California
Curated by ChEMBL
LigandPNGBDBM50010567(6-[2-Hydroxy-3-(naphthalen-1-yloxy)-propylamino]-h...)
Affinity DataKi:  9.07E+3nM. Assay description: Ki value was determined by accumulation of c-AMP in S-49 mouse lymphoma cells (Beta2).
In DepthDetails ArticlePubMed