BDBM50010655 (S)-3-Ethyl-N-(1-ethyl-pyrrolidin-2-ylmethyl)-2,5,6-trimethoxy-benzamide::CHEMBL16252
SMILES CCN1CCCC1CNC(=O)c1c(OC)c(CC)cc(OC)c1OC
InChI Key InChIKey=CNYFTYULLUBARK-UHFFFAOYSA-N
Data  1 IC50
  Tab Delimited (TSV)   2D SDfile   Computed 3D by Vconf -m prep SDfile
Find this compound or compounds like it in BindingDB:
Activity Spreadsheet -- Enzyme Inhibition Constant Data from BindingDB
Found 1 hit for monomerid = 50010655
TargetD(2) dopamine receptor(Rattus norvegicus (rat))
Astra Research Centre
Curated by ChEMBL
LigandPNGBDBM50010655((S)-3-Ethyl-N-(1-ethyl-pyrrolidin-2-ylmethyl)-2,5,...)
Affinity DataIC50:  820nM. Assay description: In vitro ability to inhibit the binding of [3H]spiperone to dopamine receptor D2 in rat striatal membranes.
In DepthDetails ArticlePubMed