BDBM50010757 CHEMBL78356::N-(4-Amino-2-methyl-phenyl)-N'-(3-hydroxy-phenyl)-guanidine(2HCl)
SMILES Cc1cc(N)ccc1N=C(N)Nc1cccc(O)c1
InChI Key InChIKey=HHJKYDLKRGBEDC-UHFFFAOYSA-N
Data  1 IC50
  Tab Delimited (TSV)   2D SDfile   Computed 3D by Vconf -m prep SDfile
Find this compound or compounds like it in BindingDB:
Activity Spreadsheet -- Enzyme Inhibition Constant Data from BindingDB
Found 1 hit for monomerid = 50010757
TargetSigma non-opioid intracellular receptor 1(Homo sapiens (Human))
University Of Oregon
Curated by ChEMBL
LigandPNGBDBM50010757(CHEMBL78356 | N-(4-Amino-2-methyl-phenyl)-N'-(3-hy...)
Affinity DataIC50:  962nM. Assay description: In vitro inhibitory activity against [3H]DTG binding to Sigma opioid receptor in guinea pig brain membrane homogenates
In DepthDetails ArticlePubMed