BDBM50010901 5-Cyclohexyl-2,2-difluoro-3-oxo-4-[2-(8-propyl-6-pyridin-3-yl-[1,2,4]triazolo[4,3-a]pyrazin-3-yl)-3-pyridin-3-yl-propionylamino]-pentanoic acid (3-methyl-butyl)-amide::CHEMBL264854
SMILES CCCc1nc(cn2c(nnc12)C(Cc1cccnc1)C(=O)NC(CC1CCCCC1)C(=O)C(F)(F)C(=O)NCCC(C)C)-c1cccnc1
InChI Key InChIKey=RJBYFTSNSHBCAM-UHFFFAOYSA-N
Data  1 IC50
  Tab Delimited (TSV)   2D SDfile   Computed 3D by Vconf -m prep SDfile
Find this compound or compounds like it in BindingDB:
Activity Spreadsheet -- Enzyme Inhibition Constant Data from BindingDB
Found 1 hit for monomerid = 50010901
TargetRenin(Homo sapiens (Human))
Ici Pharmaceuticals Group
Curated by ChEMBL
LigandPNGBDBM50010901(5-Cyclohexyl-2,2-difluoro-3-oxo-4-[2-(8-propyl-6-p...)
Affinity DataIC50:  1.80nM. Assay description: Inhibition of human renin
In DepthDetails ArticlePubMed