BDBM50011066 CHEMBL127417::Toluene-4-sulfonate3-[7-(5-octadecyloxymethyl-tetrahydro-furan-3-ylmethoxy)-heptyl]-thiazol-3-ium;Toluene-4-sulfonate
SMILES CCCCCCCCCCCCCCCCCCOCC1CC(COCCCCCCC[n+]2ccsc2)CO1
InChI Key InChIKey=UBYQAAUXLXHPGP-UHFFFAOYSA-N
Data  1 IC50
  Tab Delimited (TSV)   2D SDfile   Computed 3D by Vconf -m prep SDfile
Find this compound or compounds like it in BindingDB:
Activity Spreadsheet -- Enzyme Inhibition Constant Data from BindingDB
Found 1 hit for monomerid = 50011066
TargetPlatelet-activating factor receptor(Cavia porcellus)
J. Uriach & CíA.
Curated by ChEMBL
LigandPNGBDBM50011066(CHEMBL127417 | Toluene-4-sulfonate3-[7-(5-octadecy...)
Affinity DataIC50:  3.90E+3nM. Assay description: Inhibitory activity expressed as the concentration required to inhibit platelet-activating factor (PAF) induced maximum aggregation by 50%
In DepthDetails ArticlePubMed