BDBM50011069 3-{2-[Hydroxy-(4-tetradecyl-tetrahydro-furan-2-ylmethoxy)-phosphoryloxy]-ethyl}-thiazol-3-ium::CHEMBL338127
SMILES CCCCCCCCCCCCCCC1COC(COP([O-])(=O)OCC[n+]2ccsc2)C1
InChI Key InChIKey=NKYNOTPXTMCWLL-UHFFFAOYSA-N
Data  1 IC50
  Tab Delimited (TSV)   2D SDfile   Computed 3D by Vconf -m prep SDfile
Find this compound or compounds like it in BindingDB:
Activity Spreadsheet -- Enzyme Inhibition Constant Data from BindingDB
Found 1 hit for monomerid = 50011069
TargetPlatelet-activating factor receptor(Cavia porcellus)
J. Uriach & CíA.
Curated by ChEMBL
LigandPNGBDBM50011069(3-{2-[Hydroxy-(4-tetradecyl-tetrahydro-furan-2-ylm...)
Affinity DataIC50: >1.00E+5nM. Assay description: Inhibitory activity expressed as the concentration required to inhibit platelet-activating factor (PAF) induced maximum aggregation by 50%
In DepthDetails ArticlePubMed