BDBM50011073 CHEMBL127704::Toluene-4-sulfonate3-[5-(5-octadecyloxymethyl-tetrahydro-furan-3-ylmethoxycarbonyl)-pentyl]-thiazol-3-ium;Toluene-4-sulfonate
SMILES CCCCCCCCCCCCCCCCCCOCC1CC(COC(=O)CCCCC[n+]2ccsc2)CO1
InChI Key InChIKey=NVYLTIQWEFPKBU-UHFFFAOYSA-N
Data  1 IC50
  Tab Delimited (TSV)   2D SDfile   Computed 3D by Vconf -m prep SDfile
Find this compound or compounds like it in BindingDB:
Activity Spreadsheet -- Enzyme Inhibition Constant Data from BindingDB
Found 1 hit for monomerid = 50011073
TargetPlatelet-activating factor receptor(Cavia porcellus)
J. Uriach & CíA.
Curated by ChEMBL
LigandPNGBDBM50011073(CHEMBL127704 | Toluene-4-sulfonate3-[5-(5-octadecy...)
Affinity DataIC50:  1.50E+3nM. Assay description: Inhibitory activity expressed as the concentration required to inhibit platelet-activating factor (PAF) induced maximum aggregation by 50%
In DepthDetails ArticlePubMed