BDBM50011090 CHEMBL125315::Toluene-4-sulfonate3-[6-(2-heptadecyl-[1,3]dioxolan-4-ylmethoxy)-hexyl]-4-methyl-thiazol-3-ium;Toluene-4-sulfonate
SMILES CCCCCCCCCCCCCCCCCC1OCC(COCCCCCC[n+]2cscc2C)O1
InChI Key InChIKey=QWJSTDIKGPYOTO-UHFFFAOYSA-N
Data  1 IC50
  Tab Delimited (TSV)   2D SDfile   Computed 3D by Vconf -m prep SDfile
Find this compound or compounds like it in BindingDB:
Activity Spreadsheet -- Enzyme Inhibition Constant Data from BindingDB
Found 1 hit for monomerid = 50011090
TargetPlatelet-activating factor receptor(Cavia porcellus)
J. Uriach & CíA.
Curated by ChEMBL
LigandPNGBDBM50011090(CHEMBL125315 | Toluene-4-sulfonate3-[6-(2-heptadec...)
Affinity DataIC50:  3.10E+3nM. Assay description: Inhibitory activity expressed as the concentration required to inhibit platelet-activating factor (PAF) induced maximum aggregation by 50%
In DepthDetails ArticlePubMed