BDBM50011105 CHEMBL338883::Toluene-4-sulfonate3-[5-(2-pentadecyl-[1,3]dioxolan-4-ylmethoxycarbonyl)-pentyl]-thiazol-3-ium;Toluene-4-sulfonate
SMILES CCCCCCCCCCCCCCCC1OCC(COC(=O)CCCCC[n+]2ccsc2)O1
InChI Key InChIKey=BCWRLEXSMMOTFY-UHFFFAOYSA-N
Data  1 IC50
  Tab Delimited (TSV)   2D SDfile   Computed 3D by Vconf -m prep SDfile
Find this compound or compounds like it in BindingDB:
Activity Spreadsheet -- Enzyme Inhibition Constant Data from BindingDB
Found 1 hit for monomerid = 50011105
TargetPlatelet-activating factor receptor(Cavia porcellus)
J. Uriach & CíA.
Curated by ChEMBL
LigandPNGBDBM50011105(CHEMBL338883 | Toluene-4-sulfonate3-[5-(2-pentadec...)
Affinity DataIC50:  3.00E+3nM. Assay description: Inhibitory activity expressed as the concentration required to inhibit platelet-activating factor (PAF) induced maximum aggregation by 50%
In DepthDetails ArticlePubMed