BDBM50011110 CHEMBL340489::Toluene-4-sulfonate3-[8-(4-tetradecyl-tetrahydro-furan-2-ylmethoxy)-octyl]-thiazol-3-ium;Toluene-4-sulfonate
SMILES CCCCCCCCCCCCCCC1COC(COCCCCCCCC[n+]2ccsc2)C1
InChI Key InChIKey=PRUVSTOYDUIQNL-UHFFFAOYSA-N
Data  1 IC50
  Tab Delimited (TSV)   2D SDfile   Computed 3D by Vconf -m prep SDfile
Find this compound or compounds like it in BindingDB:
Activity Spreadsheet -- Enzyme Inhibition Constant Data from BindingDB
Found 1 hit for monomerid = 50011110
TargetPlatelet-activating factor receptor(Cavia porcellus)
J. Uriach & CíA.
Curated by ChEMBL
LigandPNGBDBM50011110(CHEMBL340489 | Toluene-4-sulfonate3-[8-(4-tetradec...)
Affinity DataIC50:  1.10E+3nM. Assay description: Inhibitory activity expressed as the concentration required to inhibit platelet-activating factor (PAF) induced maximum aggregation by 50%
In DepthDetails ArticlePubMed