BDBM50011160 CHEMBL3259940
SMILES COc1cc(cc(SC)c1C(=O)NC1(CCCN(C)C1)c1cnccn1)C(F)(F)F
InChI Key InChIKey=JGUZOZGMECQJGD-UHFFFAOYSA-N
Data  1 EC50
  Tab Delimited (TSV)   2D SDfile   Computed 3D by Vconf -m prep SDfile
Find this compound or compounds like it in BindingDB:
Activity Spreadsheet -- Enzyme Inhibition Constant Data from BindingDB
Found 1 hit for monomerid = 50011160
TargetSodium- and chloride-dependent glycine transporter 1(Homo sapiens (Human))
F. Hoffmann-La Roche
Curated by ChEMBL
LigandPNGBDBM50011160(CHEMBL3259940)
Affinity DataEC50:  1.67E+3nM. Assay description: Inhibition of human GlyT1 expressed in cells assessed as [3H]glycine uptake
In DepthDetails ArticlePubMed