BDBM50011195 3-({1-[2-tert-Butoxycarbonylamino-3-(1H-indol-3-yl)-propionyl]-pyrrolidine-2-carbonyl}-amino)-N-(1-carbamoyl-2-phenyl-ethyl)-succinamic acid::CHEMBL2370879
SMILES CC(C)(C)OC(=O)N[C@@H](Cc1c[nH]c2ccccc12)C(=O)N1CCC[C@H]1C(=O)N[C@@H](CC(O)=O)C(=O)N[C@@H](Cc1ccccc1)C(N)=O
InChI Key InChIKey=WXVQNFOMPPUFDV-FWEHEUNISA-N
Data  2 IC50
  Tab Delimited (TSV)   2D SDfile   Computed 3D by Vconf -m prep SDfile
Find this compound or compounds like it in BindingDB:
Activity Spreadsheet -- Enzyme Inhibition Constant Data from BindingDB
Found 2 hits for monomerid = 50011195
TargetCholecystokinin receptor type A(Cavia porcellus)
Abbott Laboratories
Curated by ChEMBL
LigandPNGBDBM50011195(3-({1-[2-tert-Butoxycarbonylamino-3-(1H-indol-3-yl...)
Affinity DataIC50:  2.10E+3nM. Assay description: Compound was tested for its inhibitory activity in pancreatic cholecystokinin type A receptor in guinea pig
In DepthDetails ArticlePubMed
TargetGastrin/cholecystokinin type B receptor(Homo sapiens (Human))
Abbott Laboratories
Curated by ChEMBL
LigandPNGBDBM50011195(3-({1-[2-tert-Butoxycarbonylamino-3-(1H-indol-3-yl...)
Affinity DataIC50:  2.10E+3nM. Assay description: Compound was tested for its inhibitory activity in cortical cholecystokinin type B receptor in guinea pig
In DepthDetails ArticlePubMed