BDBM50011196 3-{2-[2-tert-Butoxycarbonylamino-3-(1H-indol-3-yl)-propionylamino]-4-methylsulfanyl-butyrylamino}-N-(1-carbamoyl-2-phenyl-ethyl)-succinamic acid(Boc-CCK4)::4-(-1-amino-1-oxo-3-phenylpropan-2-ylamino)-3-(2-(2-(tert-butoxycarbonyl)-3-(1H-indol-3-yl)propanamido)-4-(methylthio)butanamido)-4-oxobutanoic acid::CHEMBL140850
SMILES CSCCC(NC(=O)C(Cc1c[nH]c2ccccc12)NC(=O)OC(C)(C)C)C(=O)NC(CC(O)=O)C(=O)NC(Cc1ccccc1)C(N)=O
InChI Key InChIKey=DDROKKYSSQPXQO-UHFFFAOYSA-N
Data  2 IC50
  Tab Delimited (TSV)   2D SDfile   Computed 3D by Vconf -m prep SDfile
Find this compound or compounds like it in BindingDB:
Activity Spreadsheet -- Enzyme Inhibition Constant Data from BindingDB
Found 2 hits for monomerid = 50011196
TargetCholecystokinin receptor type A(RAT)
Instituto De QuíMica MéDica (Csic)
Curated by ChEMBL
LigandPNGBDBM50011196(3-{2-[2-tert-Butoxycarbonylamino-3-(1H-indol-3-yl)...)
Affinity DataIC50:  1.80E+3nM. Assay description: Displacement of [3H]propionylCCK8 from rat pancreatic CCK1
In DepthDetails ArticlePubMed
TargetGastrin/cholecystokinin type B receptor(RAT)
Instituto De QuíMica MéDica (Csic)
Curated by ChEMBL
LigandPNGBDBM50011196(3-{2-[2-tert-Butoxycarbonylamino-3-(1H-indol-3-yl)...)
Affinity DataIC50:  25nM. Assay description: Displacement of [3H]propionylCCK8 from rat cerebral cortex CCK2
In DepthDetails ArticlePubMed