BDBM50011211 CHEMBL2368089::Sodium; 7-[4-(4-fluoro-phenyl)-2-isopropyl-6-methyl-pyridin-3-yl]-3,5-dihydroxy-hept-6-enoate
SMILES [Na+].CC(C)c1nc(C)cc(-c2ccc(F)cc2)c1\C=C\[C@@H](O)C[C@@H](O)CC([O-])=O
InChI Key InChIKey=USDSHKXZMLJDKC-SMUJUYJDSA-M
Data  1 IC50
  Tab Delimited (TSV)   2D SDfile   Computed 3D by Vconf -m prep SDfile
Find this compound or compounds like it in BindingDB:
Activity Spreadsheet -- Enzyme Inhibition Constant Data from BindingDB
Found 1 hit for monomerid = 50011211
Target3-hydroxy-3-methylglutaryl-coenzyme A reductase(Rattus norvegicus (rat))
Warner-Lambert
Curated by ChEMBL
LigandPNGBDBM50011211(CHEMBL2368089 | Sodium; 7-[4-(4-fluoro-phenyl)-2-i...)
Affinity DataIC50:  7.70nM. Assay description: Ability to inhibit microsomal preparation of HMG-CoA reductase in rat liver.
In DepthDetails ArticlePubMed