BDBM50011377 CHEMBL3261029
SMILES [H][C@@]12[C@@H]([C@@H](C(C)C)[C@]1([H])C(C)(C)Oc1c2c(=O)[nH]c2ccccc12)c1ccc(OC)c(OCCO)c1
InChI Key InChIKey=ASSXLIYUENVYMQ-AHCIIZGASA-N
Data  1 EC50
  Tab Delimited (TSV)   2D SDfile   Computed 3D by Vconf -m prep SDfile
Find this compound or compounds like it in BindingDB:
Activity Spreadsheet -- Enzyme Inhibition Constant Data from BindingDB
Found 1 hit for monomerid = 50011377
TargetToll-like receptor 4(Homo sapiens (Human))
Griffith University
Curated by ChEMBL
LigandPNGBDBM50011377(CHEMBL3261029)
Affinity DataEC50:  500nM. Assay description: Agonist activity at human recombinant TLR4 expressed in HEK293 cells by SEAP reporter assay
In DepthDetails ArticlePubMed