BDBM50011396 8-Methyl-3-(4-nitro-phenylcarbamoyloxy)-8-aza-bicyclo[3.2.1]octane-2-carboxylic acid methyl ester::CHEMBL163614
SMILES COC(=O)C1C2CC[C@H](C[C@@H]1OC(=O)Nc1ccc(cc1)[N+]([O-])=O)N2C
InChI Key InChIKey=IVFPUHUDFWIBQR-JLVJUDLZSA-N
Data  1 IC50
  Tab Delimited (TSV)   2D SDfile   Computed 3D by Vconf -m prep SDfile
Find this compound or compounds like it in BindingDB:
Activity Spreadsheet -- Enzyme Inhibition Constant Data from BindingDB
Found 1 hit for monomerid = 50011396
TargetSodium-dependent dopamine transporter(BOVINE)
University Of Maryland
Curated by ChEMBL
LigandPNGBDBM50011396(8-Methyl-3-(4-nitro-phenylcarbamoyloxy)-8-aza-bicy...)
Affinity DataIC50:  1.09E+3nM. Assay description: In vitro inhibitory activity towards [3H]cocaine binding to rat striatal tissue
In DepthDetails ArticlePubMed