BDBM50011424 2-(4-Hydroxy-3,5-dimethoxy-phenyl)-chromen-4-one::2-(4-hydroxy-3,5-dimethoxyphenyl)-4H-chromen-4-one::3',5'-dimethoxy-4'-hydroxyflavone::4'-Hydroxy-3',5'-dimethoxyflavone::CHEMBL354496
SMILES COc1cc(cc(OC)c1O)-c1cc(=O)c2ccccc2o1
InChI Key InChIKey=KFLJXWFYZQGKAQ-UHFFFAOYSA-N
Data  2 IC50
  Tab Delimited (TSV)   2D SDfile   Computed 3D by Vconf -m prep SDfile
Find this compound or compounds like it in BindingDB:
Activity Spreadsheet -- Enzyme Inhibition Constant Data from BindingDB
Found 2 hits for monomerid = 50011424
TargetTyrosine-protein kinase Lck(Homo sapiens (Human))
TBA
Curated by ChEMBL
LigandPNGBDBM50011424(2-(4-Hydroxy-3,5-dimethoxy-phenyl)-chromen-4-one |...)
Affinity DataIC50:  2.68E+4nM. Assay description: Inhibition of p56 lck
In DepthDetails ArticlePubMed
TargetTyrosine-protein kinase Lck(Homo sapiens (Human))
TBA
Curated by ChEMBL
LigandPNGBDBM50011424(2-(4-Hydroxy-3,5-dimethoxy-phenyl)-chromen-4-one |...)
Affinity DataIC50:  2.60E+4nM. Assay description: Ability to inhibit protein-tyrosine kinase activity of p56lck (isolated from bovine thymus) in vitro.
In DepthDetails ArticlePubMed