BDBM50011428 2-(3,4,5-Trimethoxy-phenyl)-chromen-4-one::2-(3,4,5-trimethoxyphenyl)-4H-chromen-4-one::CHEMBL307856
SMILES COc1cc(cc(OC)c1OC)-c1cc(=O)c2ccccc2o1
InChI Key InChIKey=QCXAJQVDUHKDEL-UHFFFAOYSA-N
Data  2 IC50
  Tab Delimited (TSV)   2D SDfile   Computed 3D by Vconf -m prep SDfile
Find this compound or compounds like it in BindingDB:
Activity Spreadsheet -- Enzyme Inhibition Constant Data from BindingDB
Found 2 hits for monomerid = 50011428
TargetTyrosine-protein kinase Lck(Homo sapiens (Human))
TBA
Curated by ChEMBL
LigandPNGBDBM50011428(2-(3,4,5-Trimethoxy-phenyl)-chromen-4-one | 2-(3,4...)
Affinity DataIC50: >2.56E+6nM. Assay description: Inhibition of p56 lck
In DepthDetails ArticlePubMed
TargetTyrosine-protein kinase Lck(Homo sapiens (Human))
TBA
Curated by ChEMBL
LigandPNGBDBM50011428(2-(3,4,5-Trimethoxy-phenyl)-chromen-4-one | 2-(3,4...)
Affinity DataIC50: >2.00E+6nM. Assay description: Ability to inhibit protein-tyrosine kinase activity of p56lck (isolated from bovine thymus) in vitro.
In DepthDetails ArticlePubMed