BDBM50011440 2-(4-Nitro-phenyl)-4-oxo-4H-chromene-3-carboxylic acid::2-(4-nitrophenyl)-4-oxo-4H-chromene-3-carboxylic acid::CHEMBL166389
SMILES OC(=O)c1c(oc2ccccc2c1=O)-c1ccc(cc1)[N+]([O-])=O
InChI Key InChIKey=CZQCQZSRCYPNGK-UHFFFAOYSA-N
Data  1 IC50
  Tab Delimited (TSV)   2D SDfile   Computed 3D by Vconf -m prep SDfile
Find this compound or compounds like it in BindingDB:
Activity Spreadsheet -- Enzyme Inhibition Constant Data from BindingDB
Found 1 hit for monomerid = 50011440
TargetTyrosine-protein kinase Lck(Homo sapiens (Human))
Purdue University
Curated by ChEMBL
LigandPNGBDBM50011440(2-(4-Nitro-phenyl)-4-oxo-4H-chromene-3-carboxylic ...)
Affinity DataIC50: >2.00E+6nM. Assay description: Ability to inhibit protein-tyrosine kinase activity of p56lck (isolated from bovine thymus) in vitro.
In DepthDetails ArticlePubMed