BDBM50011454 2-(4-Benzyloxy-phenyl)-6-methoxy-4-oxo-4H-chromene-3-carboxylic acid methyl ester::CHEMBL167763::methyl 2-(4-(benzyloxy)phenyl)-6-methoxy-4-oxo-4H-chromene-3-carboxylate
SMILES COC(=O)c1c(oc2ccc(OC)cc2c1=O)-c1ccc(OCc2ccccc2)cc1
InChI Key InChIKey=NMNUVYMTJVUGDE-UHFFFAOYSA-N
Data  1 IC50
  Tab Delimited (TSV)   2D SDfile   Computed 3D by Vconf -m prep SDfile
Find this compound or compounds like it in BindingDB:
Activity Spreadsheet -- Enzyme Inhibition Constant Data from BindingDB
Found 1 hit for monomerid = 50011454
TargetTyrosine-protein kinase Lck(Homo sapiens (Human))
Purdue University
Curated by ChEMBL
LigandPNGBDBM50011454(2-(4-Benzyloxy-phenyl)-6-methoxy-4-oxo-4H-chromene...)
Affinity DataIC50: >2.00E+6nM. Assay description: Ability to inhibit protein-tyrosine kinase activity of p56lck (isolated from bovine thymus) in vitro.
In DepthDetails ArticlePubMed