BDBM50011459 6-Methoxy-2-(4-nitro-phenyl)-4-oxo-4H-chromene-3-carboxylic acid::6-methoxy-2-(4-nitrophenyl)-4-oxo-4H-chromene-3-carboxylic acid::CHEMBL167624
SMILES COc1ccc2oc(-c3ccc(cc3)[N+]([O-])=O)c(C(O)=O)c(=O)c2c1
InChI Key InChIKey=KXIOJCCOSDYGMS-UHFFFAOYSA-N
Data  1 IC50
  Tab Delimited (TSV)   2D SDfile   Computed 3D by Vconf -m prep SDfile
Find this compound or compounds like it in BindingDB:
Activity Spreadsheet -- Enzyme Inhibition Constant Data from BindingDB
Found 1 hit for monomerid = 50011459
TargetTyrosine-protein kinase Lck(Homo sapiens (Human))
Purdue University
Curated by ChEMBL
LigandPNGBDBM50011459(6-Methoxy-2-(4-nitro-phenyl)-4-oxo-4H-chromene-3-c...)
Affinity DataIC50: >2.00E+6nM. Assay description: Ability to inhibit protein-tyrosine kinase activity of p56lck (isolated from bovine thymus) in vitro.
In DepthDetails ArticlePubMed