BDBM50011585 3-(4-Hydroxymethyl-imidazol-1-yl)-nonan-2-ol::CHEMBL18014
SMILES CCCCCCC(C(C)O)n1cnc(CO)c1
InChI Key InChIKey=CDVIUGQUHCYOPP-UHFFFAOYSA-N
Data  1 KI
  Tab Delimited (TSV)   2D SDfile   Computed 3D by Vconf -m prep SDfile
Find this compound or compounds like it in BindingDB:
Activity Spreadsheet -- Enzyme Inhibition Constant Data from BindingDB
Found 1 hit for monomerid = 50011585
TargetAdenosine deaminase(Bos taurus (bovine))
Universit£
Curated by ChEMBL
LigandPNGBDBM50011585(3-(4-Hydroxymethyl-imidazol-1-yl)-nonan-2-ol | CHE...)
Affinity DataKi:  2.52E+3nM. Assay description: Inhibition of calf intestinal adenosine deaminase
In DepthDetails ArticlePubMed