BDBM50011734 CHEMBL3262907
SMILES CNc1oc(nc1C#N)-c1cccc2nccnc12
InChI Key InChIKey=PDMFRJGULBANAX-UHFFFAOYSA-N
Data  1 IC50
  Tab Delimited (TSV)   2D SDfile   Computed 3D by Vconf -m prep SDfile
Find this compound or compounds like it in BindingDB:
Activity Spreadsheet -- Enzyme Inhibition Constant Data from BindingDB
Found 1 hit for monomerid = 50011734
TargetPolyunsaturated fatty acid lipoxygenase ALOX15(Homo sapiens (Human))
Harvard Medical School
Curated by ChEMBL
LigandPNGBDBM50011734(CHEMBL3262907)
Affinity DataIC50: >4.00E+4nM. Assay description: Inhibition of recombinant N-terminal His6-tagged human reticulocyte 12/15-lipoxygenase using arachidonic acid as substrate by UV-vis spectrometric an...
In DepthDetails ArticlePubMed