BDBM50011769 CHEMBL1588672
SMILES C=CCNc1oc(nc1C#N)-c1cccc2ccccc12
InChI Key InChIKey=HSHVTKVVHVMJSJ-UHFFFAOYSA-N
Data  1 IC50
  Tab Delimited (TSV)   2D SDfile   Computed 3D by Vconf -m prep SDfile
Find this compound or compounds like it in BindingDB:
Activity Spreadsheet -- Enzyme Inhibition Constant Data from BindingDB
Found 1 hit for monomerid = 50011769
TargetPolyunsaturated fatty acid lipoxygenase ALOX15(Homo sapiens (Human))
Harvard Medical School
Curated by ChEMBL
LigandPNGBDBM50011769(CHEMBL1588672)
Affinity DataIC50:  3.00E+3nM. Assay description: Inhibition of recombinant N-terminal His6-tagged human reticulocyte 12/15-lipoxygenase using arachidonic acid as substrate by UV-vis spectrometric an...
In DepthDetails ArticlePubMed