BDBM50011901 5-amino-2-aminomethyl-6-[4,6-diamino-3-(4-amino-6-diethylaminomethyl-3,5-dihydroxytetrahydro-2H-2-pyranyloxy)-2-hydroxycyclohexyloxy]tetrahydro-2H-3,4-pyrandiol::CHEMBL35650
SMILES CCN(CC)CC1OC(OC2C(N)CC(N)C(OC3OC(CN)C(O)C(O)C3N)C2O)C(O)C(N)C1O
InChI Key InChIKey=XJLZMLDGQGFSSX-UHFFFAOYSA-N
Data  1 IC50
  Tab Delimited (TSV)   2D SDfile   Computed 3D by Vconf -m prep SDfile
Find this compound or compounds like it in BindingDB:
Activity Spreadsheet -- Enzyme Inhibition Constant Data from BindingDB
Found 1 hit for monomerid = 50011901
TargetAcyl-protein thioesterase 1(Rattus norvegicus)
Universit£
Curated by ChEMBL
LigandPNGBDBM50011901(5-amino-2-aminomethyl-6-[4,6-diamino-3-(4-amino-6-...)
Affinity DataIC50:  6.50E+4nM. Assay description: In vitro inhibition of lysosomal phospholipase activity for release of labeled lysophosphatidylcholine
In DepthDetails ArticlePubMed