BDBM50011973 CHEMBL216061::Sar-Arg-Val-Tyr-Ile-His-Pro-Phe::Sar-Arg-Val-Tyr-Ile-His-Pro-Phe-OH
SMILES CC[C@H](C)[C@H](NC(=O)[C@H](Cc1ccc(O)cc1)NC(=O)[C@@H](NC(=O)[C@H](CCCNC(N)=N)NC(=O)CNC)C(C)C)C(=O)N[C@@H](Cc1cnc[nH]1)C(=O)N1CCC[C@H]1C(=O)N[C@@H](Cc1ccccc1)C(O)=O
InChI Key InChIKey=WCYZYYURIHACQW-KOTWUFNXSA-N
Data  1 IC50
  Tab Delimited (TSV)   2D SDfile   Computed 3D by Vconf -m prep SDfile
Find this compound or compounds like it in BindingDB:
Activity Spreadsheet -- Enzyme Inhibition Constant Data from BindingDB
Found 1 hit for monomerid = 50011973
TargetType-2 angiotensin II receptor(RAT)
Smithkline Beecham Pharmaceuticals
Curated by ChEMBL
LigandPNGBDBM50011973(CHEMBL216061 | Sar-Arg-Val-Tyr-Ile-His-Pro-Phe | S...)
Affinity DataIC50:  1.30nM. Assay description: In vitro inhibition of [125I]-AII specific binding towards Angiotensin II receptor in rat mesenteric membranes.
In DepthDetails ArticlePubMed