BDBM50012043 2-({5-[(2-Methyl-4-oxo-3,4-dihydro-quinazolin-6-ylmethyl)-prop-2-ynyl-amino]-thiazole-2-carbonyl}-amino)-pentanedioic acid::CHEMBL43080
SMILES Cc1nc2ccc(CN(CC#C)c3cnc(s3)C(=O)N[C@H](CCC(O)=O)C(O)=O)cc2c(=O)[nH]1
InChI Key InChIKey=UJSNKTMPXQWMRP-MRXNPFEDSA-N
Data  1 IC50
  Tab Delimited (TSV)   2D SDfile   Computed 3D by Vconf -m prep SDfile
Find this compound or compounds like it in BindingDB:
Activity Spreadsheet -- Enzyme Inhibition Constant Data from BindingDB
Found 1 hit for monomerid = 50012043
TargetThymidylate synthase(Mus musculus)
Ici Pharmaceuticals Group
Curated by ChEMBL
LigandPNGBDBM50012043(2-({5-[(2-Methyl-4-oxo-3,4-dihydro-quinazolin-6-yl...)
Affinity DataIC50:  230nM. Assay description: In vitro inhibition of partially purified L1210 thymidylate synthase (TS).
In DepthDetails ArticlePubMed