BDBM50012114 CHEMBL3263685
SMILES Cc1ccccc1N1CCN(CC1)c1ccc(cc1NC(=O)c1ccco1)C(=O)NCc1cccc(c1)C(N)=O
InChI Key InChIKey=AQRDOTOETYKPMB-UHFFFAOYSA-N
Data  1 EC50
  Tab Delimited (TSV)   2D SDfile   Computed 3D by Vconf -m prep SDfile
Find this compound or compounds like it in BindingDB:
Activity Spreadsheet -- Enzyme Inhibition Constant Data from BindingDB
Found 1 hit for monomerid = 50012114
TargetFollicle-stimulating hormone receptor(Homo sapiens (Human))
Emd-Serono Research Institute
Curated by ChEMBL
LigandPNGBDBM50012114(CHEMBL3263685)
Affinity DataEC50:  4.60E+4nM. Assay description: Positive allosteric modulation of human FSH receptor expressed in CHO cells assessed as effect on FSH-induced cAMP accumulation after 1 hr by HTRF as...
In DepthDetails ArticlePubMed