BDBM50012369 4-Acetylamino-N-(2-{4-[2-oxo-2-(6-oxo-5,6-dihydro-benzo[e]pyrido[3,2-b][1,4]diazepin-11-yl)-ethyl]-piperazin-1-yl}-ethyl)-butyramide::CHEMBL66177
SMILES CC(=O)NCCCC(=O)NCCN1CCN(CC(=O)N2c3ccccc3C(=O)Nc3cccnc23)CC1
InChI Key InChIKey=LTTBYTFVGSSGEF-UHFFFAOYSA-N
Data  3 KI
  Tab Delimited (TSV)   2D SDfile   Computed 3D by Vconf -m prep SDfile
Find this compound or compounds like it in BindingDB:
Activity Spreadsheet -- Enzyme Inhibition Constant Data from BindingDB
Found 3 hits for monomerid = 50012369
LigandPNGBDBM50012369(4-Acetylamino-N-(2-{4-[2-oxo-2-(6-oxo-5,6-dihydro-...)
Affinity DataKi:  8.82E+3nM. Assay description: Inhibition of binding of [3H]-N-methylscopolamine to muscarinic acetylcholine receptor M2 of rat heart tissue membrane.
In DepthDetails ArticlePubMed
LigandPNGBDBM50012369(4-Acetylamino-N-(2-{4-[2-oxo-2-(6-oxo-5,6-dihydro-...)
Affinity DataKi:  9.65E+3nM. Assay description: Inhibition of binding of [3H]-N-methylscopolamine to muscarinic acetylcholine receptor M1 of transfected rat A9L cells.
In DepthDetails ArticlePubMed
LigandPNGBDBM50012369(4-Acetylamino-N-(2-{4-[2-oxo-2-(6-oxo-5,6-dihydro-...)
Affinity DataKi:  1.08E+4nM. Assay description: Inhibition of binding of [3H]-N-methylscopolamine to muscarinic acetylcholine receptor M3 of transfected rat A9L cells.
In DepthDetails ArticlePubMed