BDBM50012371 CHEMBL70154::N-(10-{4-[2-Oxo-2-(6-oxo-5,6-dihydro-benzo[e]pyrido[3,2-b][1,4]diazepin-11-yl)-ethyl]-piperazin-1-yl}-decyl)-acetamide
SMILES CC(=O)NCCCCCCCCCCN1CCN(CC(=O)N2c3ccccc3C(=O)Nc3cccnc23)CC1
InChI Key InChIKey=ALDDQQRZFYRISL-UHFFFAOYSA-N
Data  2 KI
  Tab Delimited (TSV)   2D SDfile   Computed 3D by Vconf -m prep SDfile
Find this compound or compounds like it in BindingDB:
Activity Spreadsheet -- Enzyme Inhibition Constant Data from BindingDB
Found 2 hits for monomerid = 50012371
LigandPNGBDBM50012371(CHEMBL70154 | N-(10-{4-[2-Oxo-2-(6-oxo-5,6-dihydro...)
Affinity DataKi:  43nM. Assay description: Inhibition of binding of [3H]-N-Methyl-scopolamine to Muscarinic acetylcholine receptor M2 of rat heart tissue membranes.
In DepthDetails ArticlePubMed
LigandPNGBDBM50012371(CHEMBL70154 | N-(10-{4-[2-Oxo-2-(6-oxo-5,6-dihydro...)
Affinity DataKi:  75nM. Assay description: Inhibition of binding of [3H]-N-Methyl-scopolamine to Muscarinic acetylcholine receptor M1 of transfected A9L cells.
In DepthDetails ArticlePubMed