BDBM50012372 11-{2-[4-(6-Amino-hexyl)-piperazin-1-yl]-acetyl}-5,11-dihydro-benzo[e]pyrido[3,2-b][1,4]diazepin-6-one::CHEMBL305197
SMILES NCCCCCCN1CCN(CC(=O)N2c3ccccc3C(=O)Nc3cccnc23)CC1
InChI Key InChIKey=CQNPRDHSFCMGJO-UHFFFAOYSA-N
Data  2 KI
  Tab Delimited (TSV)   2D SDfile   Computed 3D by Vconf -m prep SDfile
Find this compound or compounds like it in BindingDB:
Activity Spreadsheet -- Enzyme Inhibition Constant Data from BindingDB
Found 2 hits for monomerid = 50012372
LigandPNGBDBM50012372(11-{2-[4-(6-Amino-hexyl)-piperazin-1-yl]-acetyl}-5...)
Affinity DataKi:  1.31E+3nM. Assay description: Inhibition of binding of [3H]-N-methylscopolamine to muscarinic acetylcholine receptor M1 of transfected rat A9L cells.
In DepthDetails ArticlePubMed
LigandPNGBDBM50012372(11-{2-[4-(6-Amino-hexyl)-piperazin-1-yl]-acetyl}-5...)
Affinity DataKi:  1.34E+3nM. Assay description: Inhibition of binding of [3H]-N-methylscopolamine to muscarinic acetylcholine receptor M2 of rat heart tissue membrane.
In DepthDetails ArticlePubMed