BDBM50012547 CHEMBL3260770
SMILES COc1ccc(c(C)c1)-c1ccc(OCc2cc(oc2C)C(=O)NS(=O)(=O)c2c(C)noc2C)cc1
InChI Key InChIKey=IWNCQWLXGYCYTD-UHFFFAOYSA-N
Data  1 KI
  Tab Delimited (TSV)   2D SDfile   Computed 3D by Vconf -m prep SDfile
Find this compound or compounds like it in BindingDB:
Activity Spreadsheet -- Enzyme Inhibition Constant Data from BindingDB
Found 1 hit for monomerid = 50012547
TargetProstaglandin E2 receptor EP4 subtype(Homo sapiens (Human))
Argenta Discovery
Curated by ChEMBL
LigandPNGBDBM50012547(CHEMBL3260770)
Affinity DataKi:  24nM. Assay description: Displacement of [3H]PGE2 from human prostanoid EP4 receptor expressed in cell membranes by scintillation counting
In DepthDetails ArticlePubMed