BDBM50012773 2-Ethyl-6-methoxy-4-(2-thiophen-2-yl-vinyl)-phenol::CHEMBL293825
SMILES CCc1cc(\C=C\c2cccs2)cc(OC)c1O
InChI Key InChIKey=MSYDGTVKVXHHLC-VOTSOKGWSA-N
Data  2 IC50
  Tab Delimited (TSV)   2D SDfile   Computed 3D by Vconf -m prep SDfile
Find this compound or compounds like it in BindingDB:
Activity Spreadsheet -- Enzyme Inhibition Constant Data from BindingDB
Found 2 hits for monomerid = 50012773
TargetProstaglandin G/H synthase 1/2(Homo sapiens (Human))
Boehringer Ingelheim Pharmaceuticals
Curated by ChEMBL
LigandPNGBDBM50012773(2-Ethyl-6-methoxy-4-(2-thiophen-2-yl-vinyl)-phenol...)
Affinity DataIC50:  1.40E+3nM. Assay description: Inhibition of human platelet Prostaglandin G/H synthase
In DepthDetails ArticlePubMed
TargetPolyunsaturated fatty acid 5-lipoxygenase(Homo sapiens (Human))
Boehringer Ingelheim Pharmaceuticals
Curated by ChEMBL
LigandPNGBDBM50012773(2-Ethyl-6-methoxy-4-(2-thiophen-2-yl-vinyl)-phenol...)
Affinity DataIC50:  90nM. Assay description: Inhibition of human neutrophil 5-lipoxygenase
In DepthDetails ArticlePubMed