BDBM50012790 4-[2-(2,5-Dimethyl-phenyl)-vinyl]-2,6-dimethyl-phenol::CHEMBL56576
SMILES Cc1ccc(C)c(\C=C\c2cc(C)c(O)c(C)c2)c1
InChI Key InChIKey=HBERSQLHJGYHNJ-BQYQJAHWSA-N
Data  2 IC50
  Tab Delimited (TSV)   2D SDfile   Computed 3D by Vconf -m prep SDfile
Find this compound or compounds like it in BindingDB:
Activity Spreadsheet -- Enzyme Inhibition Constant Data from BindingDB
Found 2 hits for monomerid = 50012790
TargetProstaglandin G/H synthase 1/2(Homo sapiens (Human))
Boehringer Ingelheim Pharmaceuticals
Curated by ChEMBL
LigandPNGBDBM50012790(4-[2-(2,5-Dimethyl-phenyl)-vinyl]-2,6-dimethyl-phe...)
Affinity DataIC50:  1.30E+3nM. Assay description: Inhibition of human platelet Prostaglandin G/H synthase
In DepthDetails ArticlePubMed
TargetPolyunsaturated fatty acid 5-lipoxygenase(Homo sapiens (Human))
Boehringer Ingelheim Pharmaceuticals
Curated by ChEMBL
LigandPNGBDBM50012790(4-[2-(2,5-Dimethyl-phenyl)-vinyl]-2,6-dimethyl-phe...)
Affinity DataIC50:  240nM. Assay description: Inhibition of human neutrophil 5-lipoxygenase
In DepthDetails ArticlePubMed