BDBM50012897 2-(2,6-Dichloro-3-methyl-phenylamino)-N-hydroxy-N-methyl-benzamide(Fenamate series)::CHEMBL65535
SMILES CN(O)C(=O)c1ccccc1Nc1c(Cl)ccc(C)c1Cl
InChI Key InChIKey=QQZJBHRGHVYQES-UHFFFAOYSA-N
Data  2 IC50
  Tab Delimited (TSV)   2D SDfile   Computed 3D by Vconf -m prep SDfile
Find this compound or compounds like it in BindingDB:
Activity Spreadsheet -- Enzyme Inhibition Constant Data from BindingDB
Found 2 hits for monomerid = 50012897
TargetProstaglandin G/H synthase 1/2(RAT)
Warner-Lambert
Curated by ChEMBL
LigandPNGBDBM50012897(2-(2,6-Dichloro-3-methyl-phenylamino)-N-hydroxy-N-...)
Affinity DataIC50:  1.50E+4nM. Assay description: Inhibition of Prostaglandin G/H synthase in intact RBL-1 cell line
In DepthDetails ArticlePubMed
TargetPolyunsaturated fatty acid 5-lipoxygenase(Rattus norvegicus)
Warner-Lambert
Curated by ChEMBL
LigandPNGBDBM50012897(2-(2,6-Dichloro-3-methyl-phenylamino)-N-hydroxy-N-...)
Affinity DataIC50:  1.50E+3nM. Assay description: Inhibition of 5-lipoxygenase in intact RBL-1 cell line
In DepthDetails ArticlePubMed