BDBM50013115 1-((2R,5S)-5-(hydroxymethyl)-2,5-dihydrofuran-2-yl)pyrimidine-2,4(1H,3H)-dione::1-(5-Hydroxymethyl-2,5-dihydro-furan-2-yl)-1H-pyrimidine-2,4-dione (ddeUrd)::CHEMBL89637
SMILES OC[C@H]1O[C@H](C=C1)n1ccc(=O)[nH]c1=O
InChI Key InChIKey=NZXWQUCGACTHLK-POYBYMJQSA-N
Data  4 KI
  Tab Delimited (TSV)   2D SDfile   Computed 3D by Vconf -m prep SDfile
Find this compound or compounds like it in BindingDB:
Activity Spreadsheet -- Enzyme Inhibition Constant Data from BindingDB
Found 4 hits for monomerid = 50013115
TargetDeoxyuridine 5'-triphosphate nucleotidohydrolase(Plasmodium falciparum)
Cardiff University
Curated by ChEMBL
LigandPNGBDBM50013115(1-((2R,5S)-5-(hydroxymethyl)-2,5-dihydrofuran-2-yl...)
Affinity DataKi:  2.98E+5nM. Assay description: Inhibitory constant against Plasmodium falciparum deoxyuridine 5'-triphosphate nucleotidohydrolase expressed in Escherichia coli BL21 (DE3) cells
In DepthDetails ArticlePubMed
TargetThymidine kinase, cytosolic(Homo sapiens (Human))
Michigan Cancer Foundation
Curated by ChEMBL
LigandPNGBDBM50013115(1-((2R,5S)-5-(hydroxymethyl)-2,5-dihydrofuran-2-yl...)
Affinity DataKi:  4.45E+5nM. Assay description: Inhibitory affect against rabbit thymus thymidine kinase
In DepthDetails ArticlePubMed
TargetPutative deoxyuridine triphosphatase(Leishmania major)
Cardiff University
Curated by ChEMBL
LigandPNGBDBM50013115(1-((2R,5S)-5-(hydroxymethyl)-2,5-dihydrofuran-2-yl...)
Affinity DataKi: >1.00E+6nM. Assay description: Inhibitory constant against Leishmania major deoxyuridine 5'-triphosphate nucleotidohydrolase
In DepthDetails ArticlePubMed
TargetDeoxyuridine 5'-triphosphate nucleotidohydrolase, mitochondrial(Homo sapiens (Human))
Cardiff University
Curated by ChEMBL
LigandPNGBDBM50013115(1-((2R,5S)-5-(hydroxymethyl)-2,5-dihydrofuran-2-yl...)
Affinity DataKi: >1.00E+6nM. Assay description: Inhibitory constant against human deoxyuridine 5'-triphosphate nucleotidohydrolase expressed in Escherichia coli BL21 (DE3) cells
In DepthDetails ArticlePubMed