BDBM50013116 Benzoic acid 5-(2,4-dioxo-3,4-dihydro-2H-pyrimidin-1-yl)-tetrahydro-furan-2-ylmethyl ester (ddUrd)::CHEMBL88993
SMILES O=C(OC[C@@H]1CC[C@@H](O1)n1ccc(=O)[nH]c1=O)c1ccccc1
InChI Key InChIKey=PBFATPYEUBCWJS-GXTWGEPZSA-N
Data  2 KI
  Tab Delimited (TSV)   2D SDfile   Computed 3D by Vconf -m prep SDfile
Find this compound or compounds like it in BindingDB:
Activity Spreadsheet -- Enzyme Inhibition Constant Data from BindingDB
Found 2 hits for monomerid = 50013116
TargetThymidine kinase, cytosolic(Homo sapiens (Human))
Michigan Cancer Foundation
Curated by ChEMBL
LigandPNGBDBM50013116(Benzoic acid 5-(2,4-dioxo-3,4-dihydro-2H-pyrimidin...)
Affinity DataKi:  9.75E+5nM. Assay description: Inhibitory affect against rabbit deoxycytidine kinase
In DepthDetails ArticlePubMed
TargetThymidine kinase, cytosolic(Homo sapiens (Human))
Michigan Cancer Foundation
Curated by ChEMBL
LigandPNGBDBM50013116(Benzoic acid 5-(2,4-dioxo-3,4-dihydro-2H-pyrimidin...)
Affinity DataKi: >1.00E+6nM. Assay description: Inhibitory affect against rabbit thymus thymidine kinase and represented as molt/4F kinase.
In DepthDetails ArticlePubMed