BDBM50013119 1-(5-Hydroxymethyl-tetrahydro-furan-2-yl)-4-thioxo-3,4-dihydro-1H-pyrimidin-2-one (ddUrdS)::CHEMBL89055
SMILES OC[C@@H]1CC[C@@H](O1)n1ccc(=S)[nH]c1=O
InChI Key InChIKey=HFUKRBLAIFTSMI-POYBYMJQSA-N
Data  1 KI
  Tab Delimited (TSV)   2D SDfile   Computed 3D by Vconf -m prep SDfile
Find this compound or compounds like it in BindingDB:
Activity Spreadsheet -- Enzyme Inhibition Constant Data from BindingDB
Found 1 hit for monomerid = 50013119
TargetThymidine kinase, cytosolic(Homo sapiens (Human))
Michigan Cancer Foundation
Curated by ChEMBL
LigandPNGBDBM50013119(1-(5-Hydroxymethyl-tetrahydro-furan-2-yl)-4-thioxo...)
Affinity DataKi:  1.28E+6nM. Assay description: Inhibitory affect against rabbit thymus thymidine kinase
In DepthDetails ArticlePubMed