BDBM50013343 CHEMBL3349621::deamino [Mpr105,Cys121] r-ANF (99-126)(Atrial Natriuretic Factor)
SMILES [H][C@]1([#7]-[#6](=O)-[#6@H](-[#6]-[#6]-[#6]\[#7]=[#6](\[#7])-[#7])-[#7]-[#6](=O)-[#6@H](-[#6]-[#6](-[#8])=O)-[#7]-[#6](=O)[C@@]([H])([#7]-[#6](=O)-[#6@H](-[#6]-[#6]-[#6]\[#7]=[#6](\[#7])-[#7])-[#7]-[#6](=O)-[#6]-[#7]-[#6](=O)-[#6]-[#7]-[#6](=O)-[#6@H](-[#6]-c2ccccc2)-[#7]-[#6](=O)-[#6]-[#6]-[#16]-[#16]-[#6]-[#6@H](-[#7]-[#6](=O)-[#6]-[#7]-[#6](=O)-[#6@H](-[#6]-[#6](-[#6])-[#6])-[#7]-[#6](=O)-[#6]-[#7]-[#6](=O)-[#6@H](-[#6]-[#8])-[#7]-[#6](=O)-[#6@H](-[#6]-[#6]-[#6](-[#7])=O)-[#7]-[#6](=O)-[#6@H](-[#6])-[#7]-[#6](=O)-[#6]-[#7]-[#6]1=O)-[#6](=O)-[#7]-[#6@@H](-[#6]-[#6](-[#7])=O)-[#6](=O)-[#7]-[#6@@H](-[#6]-[#8])-[#6](=O)-[#7]-[#6@@H](-[#6]-c1ccccc1)-[#6](=O)-[#7]-[#6@@H](-[#6]-[#6]-[#6]\[#7]=[#6](\[#7])-[#7])-[#6](=O)-[#7]-[#6@@H](-[#6]-c1ccc(-[#8])cc1)-[#6](-[#8])=O)[#6@@H](-[#6])-[#6]-[#6])[#6@@H](-[#6])-[#6]-[#6]
InChI Key InChIKey=AHVQZEHMMJUEJS-LCPVJALYSA-N
Data  2 IC50
  Tab Delimited (TSV)   2D SDfile   Computed 3D by Vconf -m prep SDfile
Find this compound or compounds like it in BindingDB:
Activity Spreadsheet -- Enzyme Inhibition Constant Data from BindingDB
Found 2 hits for monomerid = 50013343
TargetAtrial natriuretic peptide receptor 2(Bos taurus)
Bio Mega Laboratories
Curated by ChEMBL
LigandPNGBDBM50013343(CHEMBL3349621 | deamino [Mpr105,Cys121] r-ANF (99-...)
Affinity DataIC50:  1nM. Assay description: Binding affinity was determined based on the displacement of [125]r-ANF (99-126) from binding sites on bovine adrenal zona glomerulosa cell membranes...
In DepthDetails ArticlePubMed
TargetAtrial natriuretic peptide receptor 3(Mus musculus)
Bio Mega Laboratories
Curated by ChEMBL
LigandPNGBDBM50013343(CHEMBL3349621 | deamino [Mpr105,Cys121] r-ANF (99-...)
Affinity DataIC50:  0.220nM. Assay description: Binding affinity was determined based on the displacement of [125]r-ANF (99-126) from binding sites onmouse fibroblasts (NIH 3T3) cells (Atrionatriur...
In DepthDetails ArticlePubMed