BDBM50013364 CHEMBL2371380::Glu-Cys-Arg-Ser-Thr-Ser-Tyr-Ala-Gly-Ala-Val-Val-Asn-Asp-Leu
SMILES [#6]-[#6](-[#6])-[#6]-[#6@H](-[#7]-[#6](=O)-[#6@H](-[#6]-[#6](-[#8])=O)-[#7]-[#6](=O)-[#6@H](-[#6]-[#6](-[#7])=O)-[#7]-[#6](=O)-[#6@@H](-[#7]-[#6](=O)-[#6@@H](-[#7]-[#6](=O)-[#6@H](-[#6])-[#7]-[#6](=O)-[#6]-[#7]-[#6](=O)-[#6@H](-[#6])-[#7]-[#6](=O)-[#6@H](-[#6]-c1ccc(-[#8])cc1)-[#7]-[#6](=O)-[#6@H](-[#6]-[#8])-[#7]-[#6](=O)-[#6@@H](-[#7]-[#6](=O)-[#6@H](-[#6]-[#8])-[#7]-[#6](=O)-[#6@H](-[#6]-[#6]-[#6]\[#7]=[#6](\[#7])-[#7])-[#7]-[#6](=O)-[#6@H](-[#6]-[#16])-[#7]-[#6](=O)-[#6@@H](-[#7])-[#6]-[#6]-[#6](-[#8])=O)-[#6@@H](-[#6])-[#8])-[#6](-[#6])-[#6])-[#6](-[#6])-[#6])-[#6](-[#8])=O
InChI Key InChIKey=HPKYGVPBDLOIBT-FLONGNAISA-N
Data  2 IC50
  Tab Delimited (TSV)   2D SDfile   Computed 3D by Vconf -m prep SDfile
Find this compound or compounds like it in BindingDB:
Activity Spreadsheet -- Enzyme Inhibition Constant Data from BindingDB
Found 2 hits for monomerid = 50013364
TargetRibonucleoside-diphosphate reductase large subunit(Human herpesvirus 1 (strain 17) (HHV-1) (Human her...)
Notre-Dame Hospital Research
Curated by ChEMBL
LigandPNGBDBM50013364(CHEMBL2371380 | Glu-Cys-Arg-Ser-Thr-Ser-Tyr-Ala-Gl...)
Affinity DataIC50:  6.00E+4nM. Assay description: Inhibitory activity against HSV-1 Ribonucleoside diphosphate reductase was determined
In DepthDetails ArticlePubMed
TargetRibonucleoside-diphosphate reductase large subunit(Human herpesvirus 1 (strain 17) (HHV-1) (Human her...)
Notre-Dame Hospital Research
Curated by ChEMBL
LigandPNGBDBM50013364(CHEMBL2371380 | Glu-Cys-Arg-Ser-Thr-Ser-Tyr-Ala-Gl...)
Affinity DataIC50:  4.20E+4nM. Assay description: Inhibitory activity against HSV-1 Ribonucleoside diphosphate reductase was determined
In DepthDetails ArticlePubMed