BDBM50013435 CHEMBL3264105
SMILES OP(O)(=O)Cc1ccc(Nc2cc(ncn2)-c2cccc(c2)[N+]([O-])=O)cc1
InChI Key InChIKey=IODPOLOMIWXHEG-UHFFFAOYSA-N
Data  1 IC50
  Tab Delimited (TSV)   2D SDfile   Computed 3D by Vconf -m prep SDfile
Find this compound or compounds like it in BindingDB:
Activity Spreadsheet -- Enzyme Inhibition Constant Data from BindingDB
Found 1 hit for monomerid = 50013435
TargetCyclin-T1/Cyclin-dependent kinase 9(Homo sapiens (Human))
Vichem Chemie
Curated by ChEMBL
LigandPNGBDBM50013435(CHEMBL3264105)
Affinity DataIC50:  2.10E+3nM. Assay description: Inhibition of CDK9/CycT1 (unknown origin) using TAMRA-Rbtide and ATP as substrate after 1 hr
In DepthDetails ArticlePubMed